BDBM444626 US10662186, Compound 208::US10988476, Compound I-208
SMILES Cc1nc2c(F)cc(cc2n1C(C)(C)C)-c1nc(Nc2ccc3CN(CCS(C)(=O)=O)CCc3n2)ncc1F
InChI Key InChIKey=SDAWBLGFXWXOCC-UHFFFAOYSA-N
Data  6 IC50
  Tab Delimited (TSV)   2D SDfile   Computed 3D by Vconf -m prep SDfile
Find this compound or compounds like it in BindingDB:
Activity Spreadsheet -- Enzyme Inhibition Constant Data from BindingDB
Found 6 hits for monomerid = 444626
TargetCyclin-dependent kinase 4(Homo sapiens (Human))
Shanghai Pharmaceuticals Holding
US Patent
LigandPNGBDBM444626(US10662186, Compound 208 | US10988476, Compound I-...)
Affinity DataIC50:  1.39nM. Assay description: 1. Take 10 mM stock solution of the test compound, in 96-well compound plate, DMSO was used to dilute the compound to an initial concentration of 100...
Ligand InfoPC cidPC sid
In DepthDetails US Patent
TargetCyclin-dependent kinase 6(Homo sapiens (Human))
Shanghai Pharmaceuticals Holding
US Patent
LigandPNGBDBM444626(US10662186, Compound 208 | US10988476, Compound I-...)
Affinity DataIC50:  2.58nM. Assay description: 1. Take 10 mM stock solution of the test compound, in 96-well compound plate, DMSO was used to dilute the compound to an initial concentration of 100...
Ligand InfoPC cidPC sid
In DepthDetails US Patent
TargetCyclin-dependent kinase 2(Homo sapiens (Human))
Shanghai Pharmaceuticals Holding
US Patent
LigandPNGBDBM444626(US10662186, Compound 208 | US10988476, Compound I-...)
Affinity DataIC50:  13.1nM. Assay description: 1. Take 10 mM stock solution of the test compound, in 96-well compound plate, DMSO was used to dilute the compound to an initial concentration of 100...
Ligand InfoPC cidPC sid
In DepthDetails US Patent
TargetCyclin-dependent kinase 4(Homo sapiens (Human))
Shanghai Pharmaceuticals Holding
US Patent
LigandPNGBDBM444626(US10662186, Compound 208 | US10988476, Compound I-...)
Affinity DataIC50:  1.39nM. Assay description: 1. Take 10 mM stock solution of the test compound, in 96-well compound plate, DMSO was used to dilute the compound to an initial concentration of 100...
Ligand InfoPC cidPC sid
In DepthDetails US Patent
TargetCyclin-dependent kinase 6(Homo sapiens (Human))
Shanghai Pharmaceuticals Holding
US Patent
LigandPNGBDBM444626(US10662186, Compound 208 | US10988476, Compound I-...)
Affinity DataIC50:  2.58nM. Assay description: 1. Take 10 mM stock solution of the test compound, in 96-well compound plate, DMSO was used to dilute the compound to an initial concentration of 100...
Ligand InfoPC cidPC sid
In DepthDetails US Patent
TargetCyclin-dependent kinase 2(Homo sapiens (Human))
Shanghai Pharmaceuticals Holding
US Patent
LigandPNGBDBM444626(US10662186, Compound 208 | US10988476, Compound I-...)
Affinity DataIC50:  13.1nM. Assay description: 1. Take 10 mM stock solution of the test compound, in 96-well compound plate, DMSO was used to dilute the compound to an initial concentration of 100...
Ligand InfoPC cidPC sid
In DepthDetails US Patent