BDBM444675 US10662189, Compound WX002
SMILES CCOc1cc(CC(CS(C)(=O)=O)n2c3ncc(cc3[nH]c2=O)C(F)(F)F)ccc1OC
InChI Key
Data  1 IC50
  Tab Delimited (TSV)   2D SDfile   Computed 3D by Vconf -m prep SDfile
Find this compound or compounds like it in BindingDB:
Activity Spreadsheet -- Enzyme Inhibition Constant Data from BindingDB
Found 1 hit for monomerid = 444675
TargetcAMP-specific 3',5'-cyclic phosphodiesterase 4B(Homo sapiens (Human))
Shijiazhuang Sagacity New Drug Development
US Patent
LigandPNGBDBM444675(US10662189, Compound WX002)
Affinity DataIC50:  5.66nM. Assay description: The enzyme activity was indicated by measuring the AMP/GMP expression and tracing AMP/GMP antibody binding based on fluorescence polarization in the ...
Ligand InfoPC cidPC sid
In DepthDetails US Patent