BDBM444689 US10662189, Compound WX003
SMILES CCOc1cc(CC(CS(C)(=O)=O)n2c3ncc(F)cc3[nH]c2=O)ccc1OC
InChI Key
Data  1 IC50
  Tab Delimited (TSV)   2D SDfile   Computed 3D by Vconf -m prep SDfile
Find this compound or compounds like it in BindingDB:
Activity Spreadsheet -- Enzyme Inhibition Constant Data from BindingDB
Found 1 hit for monomerid = 444689
TargetcAMP-specific 3',5'-cyclic phosphodiesterase 4B(Homo sapiens (Human))
Shijiazhuang Sagacity New Drug Development
US Patent
LigandPNGBDBM444689(US10662189, Compound WX003)
Affinity DataIC50:  10.6nM. Assay description: The enzyme activity was indicated by measuring the AMP/GMP expression and tracing AMP/GMP antibody binding based on fluorescence polarization in the ...
Ligand InfoPC cidPC sid
In DepthDetails US Patent