BDBM44471 (E)-2-(4-methylphenyl)sulfonyl-3-(2-morpholin-4-yl-4-oxidanylidene-pyrido[1,2-a]pyrimidin-3-yl)prop-2-enenitrile::(E)-2-(4-methylphenyl)sulfonyl-3-(2-morpholin-4-yl-4-oxopyrido[1,2-a]pyrimidin-3-yl)prop-2-enenitrile::(E)-2-(4-methylphenyl)sulfonyl-3-[2-(4-morpholinyl)-4-oxo-3-pyrido[1,2-a]pyrimidinyl]-2-propenenitrile::(E)-3-(2-Morpholin-4-yl-4-oxo-4H-pyrido[1,2-a]pyrimidin-3-yl)-2-(toluene-4-sulfonyl)-acrylonitrile::(E)-3-(4-keto-2-morpholino-pyrido[1,2-a]pyrimidin-3-yl)-2-tosyl-acrylonitrile::MLS000556942::SMR000148059::cid_1831698
SMILES Cc1ccc(cc1)S(=O)(=O)C(=C\c1c(nc2ccccn2c1=O)N1CCOCC1)\C#N
InChI Key InChIKey=OJORZKVERSHWEO-NBVRZTHBSA-N
Data  2 IC50
  Tab Delimited (TSV)   2D SDfile   Computed 3D by Vconf -m prep SDfile
Find this compound or compounds like it in BindingDB:
Activity Spreadsheet -- Enzyme Inhibition Constant Data from BindingDB
Found 2 hits for monomerid = 44471
TargetEphrin type-A receptor 4(Mus musculus)
Burnham Center For Chemical Genomics
Curated by PubChem BioAssay
LigandPNGBDBM44471((E)-2-(4-methylphenyl)sulfonyl-3-(2-morpholin-4-yl...)
Affinity DataIC50: >5.00E+4nM. Assay description: Sanford-Burnham Center for Chemical Genomics (SBCCG) Sanford-Burnham Medical Research Institute (SBMRI, San Diego, CA) NIH Molecular Libraries Screen...
In DepthDetails PCBioAssay
TargetEphrin type-A receptor 4(Mus musculus)
Burnham Center For Chemical Genomics
Curated by PubChem BioAssay
LigandPNGBDBM44471((E)-2-(4-methylphenyl)sulfonyl-3-(2-morpholin-4-yl...)
Affinity DataIC50: >1.00E+5nM. Assay description: Data Source: Sanford-Burnham Center for Chemical Genomics (SBCCG) Source Affiliation: Sanford-Burnham Medical Research Institute (SBMRI, San Diego, C...
In DepthDetails PCBioAssay