BDBM444804 US10662189, Compound WX055
SMILES CCOc1cc(ccc1OC)[C@@H](CS(C)(=O)=O)n1c2ncc(Br)cc2n(Cc2cncc(C)n2)c1=O
InChI Key InChIKey=ZPSBUNSRWJPDDF-HXUWFJFHSA-N
Data  1 IC50
  Tab Delimited (TSV)   2D SDfile   Computed 3D by Vconf -m prep SDfile
Find this compound or compounds like it in BindingDB:
Activity Spreadsheet -- Enzyme Inhibition Constant Data from BindingDB
Found 1 hit for monomerid = 444804
TargetcAMP-specific 3',5'-cyclic phosphodiesterase 4B(Homo sapiens (Human))
Shijiazhuang Sagacity New Drug Development
US Patent
LigandPNGBDBM444804(US10662189, Compound WX055)
Affinity DataIC50:  6.99nM. Assay description: The enzyme activity was indicated by measuring the AMP/GMP expression and tracing AMP/GMP antibody binding based on fluorescence polarization in the ...
Ligand InfoPC cidPC sid
In DepthDetails US Patent