BDBM444834 US10667515, Compound 6-methyl-nicotine
SMILES CN1CCC[C@H]1c1ccc(C)nc1
InChI Key InChIKey=SWNIAVIKMKSDBJ-NSHDSACASA-N
Data  1 EC50
  Tab Delimited (TSV)   2D SDfile   Computed 3D by Vconf -m prep SDfile
Find this compound or compounds like it in BindingDB:
Activity Spreadsheet -- Enzyme Inhibition Constant Data from BindingDB
Found 1 hit for monomerid = 444834
TargetResistance to inhibitors of cholinesterase protein 3(Pig roundworm)
Iowa State University Research Foundation
US Patent
LigandPNGBDBM444834(US10667515, Compound 6-methyl-nicotine)
Affinity DataEC50:  6.13E+3nM. Assay description: Nematode eggs are isolated from fresh feces by centrifugation and flotation. The eggs are washed and inspected to confirm embryonation has not starte...
In DepthDetails US Patent