BDBM444909 6-((2,4'-dichloro-5-methoxy-4-biphenylyl)(methylcarbamoyl)amino)-::US10668067, Example 1-70
SMILES CNC(=O)N(c1ccc(cn1)S(=O)(=O)Nc1ccon1)c1cc(Cl)c(cc1OC)-c1ccc(Cl)cc1
InChI Key InChIKey=OVGBGLJXYSJAIF-UHFFFAOYSA-N
Data  1 IC50
  Tab Delimited (TSV)   2D SDfile   Computed 3D by Vconf -m prep SDfile
Find this compound or compounds like it in BindingDB:
Activity Spreadsheet -- Enzyme Inhibition Constant Data from BindingDB
Found 1 hit for monomerid = 444909
TargetSodium channel protein type 9 subunit alpha(Homo sapiens (Human))
Amgen
US Patent
LigandPNGBDBM444909(6-((2,4'-dichloro-5-methoxy-4-biphenylyl)(methylca...)
Affinity DataIC50:  52nM. Assay description: HEK 293 cells stably transfected with human Nav1.7 were recorded in whole cell voltage clamp mode with the PatchXpress automated electrophysiology sy...
Ligand InfoPC cidPC sid
In DepthDetails US Patent