BDBM444919 6-((4'-chloro-2-fluoro-5-methoxy-3'-methyl-4-::US10668067, Example 1-80
SMILES CNC(=O)N(c1ccc(cn1)S(=O)(=O)Nc1ncccn1)c1cc(F)c(cc1OC)-c1ccc(Cl)c(C)c1
InChI Key InChIKey=BHLMVRNRCHRWJZ-UHFFFAOYSA-N
Data  1 IC50
  Tab Delimited (TSV)   2D SDfile   Computed 3D by Vconf -m prep SDfile
Find this compound or compounds like it in BindingDB:
Activity Spreadsheet -- Enzyme Inhibition Constant Data from BindingDB
Found 1 hit for monomerid = 444919
TargetSodium channel protein type 9 subunit alpha(Homo sapiens (Human))
Amgen
US Patent
LigandPNGBDBM444919(6-((4'-chloro-2-fluoro-5-methoxy-3'-methyl-4- | US...)
Affinity DataIC50:  39nM. Assay description: HEK 293 cells stably transfected with human Nav1.7 were recorded in whole cell voltage clamp mode with the PatchXpress automated electrophysiology sy...
Ligand InfoPC cidPC sid
In DepthDetails US Patent