BDBM444954 6-((2,4'-difluoro-5-methoxy-3'-(trifluoromethoxy)-4-::US10668067, Example 3-13
SMILES CNC(=O)N(c1ccc(cn1)S(=O)(=O)Nc1cccnn1)c1cc(F)c(cc1OC)-c1ccc(F)c(OC(F)(F)F)c1
InChI Key InChIKey=HEMVNRUIGOXROO-UHFFFAOYSA-N
Data  6 IC50
  Tab Delimited (TSV)   2D SDfile   Computed 3D by Vconf -m prep SDfile
Find this compound or compounds like it in BindingDB:
Activity Spreadsheet -- Enzyme Inhibition Constant Data from BindingDB
Found 6 hits for monomerid = 444954
TargetSodium channel protein type 9 subunit alpha(Homo sapiens (Human))
Amgen
US Patent
LigandPNGBDBM444954(6-((2,4'-difluoro-5-methoxy-3'-(trifluoromethoxy)-...)
Affinity DataIC50:  7nM. Assay description: HEK 293 cells stably transfected with human Nav1.7 were recorded in whole cell voltage clamp mode with the PatchXpress automated electrophysiology sy...
Ligand InfoPC cidPC sid
In DepthDetails US Patent
TargetCytochrome P450 2D6(Homo sapiens (Human))
Moma Therapeutics
Curated by ChEMBL
LigandPNGBDBM444954(6-((2,4'-difluoro-5-methoxy-3'-(trifluoromethoxy)-...)
Affinity DataIC50:  3.00E+4nM. Assay description: Time dependent inhibition of CYP2D6 (unknown origin) incubated for 30 mins
Ligand InfoPC cidPC sid
In DepthDetails PubMed
TargetSodium channel protein type 9 subunit alpha(Homo sapiens (Human))
Amgen
US Patent
LigandPNGBDBM444954(6-((2,4'-difluoro-5-methoxy-3'-(trifluoromethoxy)-...)
Affinity DataIC50:  7nM. Assay description: Inhibition of human Nav1.7 by PatchXpress assay
Ligand InfoPC cidPC sid
In DepthDetails PubMed
TargetCytochrome P450 3A4(Homo sapiens (Human))
Moma Therapeutics
Curated by ChEMBL
LigandPNGBDBM444954(6-((2,4'-difluoro-5-methoxy-3'-(trifluoromethoxy)-...)
Affinity DataIC50: >5.00E+4nM. Assay description: Time dependent inhibition of CYP3A4 in human liver microsomes using midazolam as substrate incubated for 30 mins
Ligand InfoPC cidPC sid
In DepthDetails PubMed
TargetCytochrome P450 3A4(Homo sapiens (Human))
Moma Therapeutics
Curated by ChEMBL
LigandPNGBDBM444954(6-((2,4'-difluoro-5-methoxy-3'-(trifluoromethoxy)-...)
Affinity DataIC50: >5.00E+4nM. Assay description: Time dependent inhibition of CYP3A4 in human liver microsomes using midazolam as substrate preincubated for 30 mins followed by substrate addition
Ligand InfoPC cidPC sid
In DepthDetails PubMed
TargetCytochrome P450 2D6(Homo sapiens (Human))
Moma Therapeutics
Curated by ChEMBL
LigandPNGBDBM444954(6-((2,4'-difluoro-5-methoxy-3'-(trifluoromethoxy)-...)
Affinity DataIC50:  1.90E+4nM. Assay description: Time dependent inhibition of CYP2D6 (unknown origin) preincubated for 30 mins followed by substrate addition
Ligand InfoPC cidPC sid
In DepthDetails PubMed