BDBM444964 6-((3',6-dichloro-4-methoxy-4'-methyl-3-::US10668067, Example 4.9
SMILES CNC(=O)N(c1ccc(cn1)S(=O)(=O)Nc1ccon1)c1cc(c(Cl)cc1OC)-c1ccc(C)c(Cl)c1
InChI Key InChIKey=DTSFUKVNUDDJBR-UHFFFAOYSA-N
Data  1 IC50
  Tab Delimited (TSV)   2D SDfile   Computed 3D by Vconf -m prep SDfile
Find this compound or compounds like it in BindingDB:
Activity Spreadsheet -- Enzyme Inhibition Constant Data from BindingDB
Found 1 hit for monomerid = 444964
TargetSodium channel protein type 9 subunit alpha(Homo sapiens (Human))
Amgen
US Patent
LigandPNGBDBM444964(6-((3',6-dichloro-4-methoxy-4'-methyl-3- | US10668...)
Affinity DataIC50:  76nM. Assay description: HEK 293 cells stably transfected with human Nav1.7 were recorded in whole cell voltage clamp mode with the PatchXpress automated electrophysiology sy...
Ligand InfoPC cidPC sid
In DepthDetails US Patent