BDBM44500 MLS000544060::N-[(Z)-1-(1-naphthylcarbamoyl)-2-(4-nitrophenyl)vinyl]benzamide::N-[(Z)-3-(1-naphthalenylamino)-1-(4-nitrophenyl)-3-oxoprop-1-en-2-yl]benzamide::N-[(Z)-3-(naphthalen-1-ylamino)-1-(4-nitrophenyl)-3-oxidanylidene-prop-1-en-2-yl]benzamide::N-[(Z)-3-(naphthalen-1-ylamino)-1-(4-nitrophenyl)-3-oxoprop-1-en-2-yl]benzamide::N-{2-{4-nitrophenyl}-1-[(1-naphthylamino)carbonyl]vinyl}benzamide::SMR000163674::cid_6504838
SMILES [O-][N+](=O)c1ccc(\C=C(/NC(=O)c2ccccc2)C(=O)Nc2cccc3ccccc23)cc1
InChI Key InChIKey=NLHHNUMTIRZZQZ-ULJHMMPZSA-N
Data  2 IC50
  Tab Delimited (TSV)   2D SDfile   Computed 3D by Vconf -m prep SDfile
Find this compound or compounds like it in BindingDB:
Activity Spreadsheet -- Enzyme Inhibition Constant Data from BindingDB
Found 2 hits for monomerid = 44500
TargetEphrin type-A receptor 4(Mus musculus)
Burnham Center For Chemical Genomics
Curated by PubChem BioAssay
LigandPNGBDBM44500(MLS000544060 | N-[(Z)-1-(1-naphthylcarbamoyl)-2-(4...)
Affinity DataIC50: >5.00E+4nM. Assay description: Sanford-Burnham Center for Chemical Genomics (SBCCG) Sanford-Burnham Medical Research Institute (SBMRI, San Diego, CA) NIH Molecular Libraries Screen...
In DepthDetails PCBioAssay
TargetEphrin type-A receptor 4(Mus musculus)
Burnham Center For Chemical Genomics
Curated by PubChem BioAssay
LigandPNGBDBM44500(MLS000544060 | N-[(Z)-1-(1-naphthylcarbamoyl)-2-(4...)
Affinity DataIC50:  1.14E+4nM. Assay description: Data Source: Sanford-Burnham Center for Chemical Genomics (SBCCG) Source Affiliation: Sanford-Burnham Medical Research Institute (SBMRI, San Diego, C...
In DepthDetails PCBioAssay