BDBM445010 US10668167, Compound 19
SMILES C[C@]12C[C@H](O)[C@@]3(F)[C@@H](C[C@H](F)C4=CC(=O)C=C[C@]34C)[C@@H]1C[C@H]1O[C@@H](O[C@@]21C(=O)CO)c1ccc(Cc2ccc(N)cc2)cc1
InChI Key InChIKey=JQFDYENGUWMLDJ-HWIYRGLUSA-N
Data  1 IC50
  Tab Delimited (TSV)   2D SDfile   Computed 3D by Vconf -m prep SDfile
Find this compound or compounds like it in BindingDB:
Activity Spreadsheet -- Enzyme Inhibition Constant Data from BindingDB
Found 1 hit for monomerid = 445010
TargetGlucocorticoid receptor(Homo sapiens (Human))
Abbvie
US Patent
LigandPNGBDBM445010(US10668167, Compound 19)
Affinity DataIC50:  10.1nM. Assay description: Small molecules were tested for glucocorticoid receptor (GR) binding using the Polarscreen™ Glucocorticoid Receptor Assay Kit, Red (ThermoFisher A 15...
Ligand InfoPC cidPC sid
In DepthDetails US Patent