BDBM445023 US10668167, Compound 31
SMILES CNc1ccc(Cc2ccc(cc2)[C@@H]2O[C@@H]3C[C@H]4[C@@H]5C[C@H](F)C6=CC(=O)C=C[C@]6(C)[C@@]5(F)[C@@H](O)C[C@]4(C)[C@@]3(O2)C(=O)CO)cc1OC
InChI Key InChIKey=MYTSRIFZTRZXOK-BGFNTKHQSA-N
Data  1 IC50
  Tab Delimited (TSV)   2D SDfile   Computed 3D by Vconf -m prep SDfile
Find this compound or compounds like it in BindingDB:
Activity Spreadsheet -- Enzyme Inhibition Constant Data from BindingDB
Found 1 hit for monomerid = 445023
TargetGlucocorticoid receptor(Homo sapiens (Human))
Abbvie
US Patent
LigandPNGBDBM445023(US10668167, Compound 31)
Affinity DataIC50:  10.7nM. Assay description: Small molecules were tested for glucocorticoid receptor (GR) binding using the Polarscreen™ Glucocorticoid Receptor Assay Kit, Red (ThermoFisher A 15...
Ligand InfoPC cidPC sid
In DepthDetails US Patent