BDBM445119 (S)-N-(5-benzylthiazol-2-yl)-1-cyano-N-methylpyrrolidine-2-carboxamide::US10669234, Example 58::US11319287, Example 58
SMILES CN(C(=O)[C@@H]1CCCN1C#N)c1ncc(Cc2ccccc2)s1
InChI Key InChIKey=OZQSHOAYDYFPRI-HNNXBMFYSA-N
Data  2 IC50
  Tab Delimited (TSV)   2D SDfile   Computed 3D by Vconf -m prep SDfile
Find this compound or compounds like it in BindingDB:
Activity Spreadsheet -- Enzyme Inhibition Constant Data from BindingDB
Found 2 hits for monomerid = 445119
TargetUbiquitin carboxyl-terminal hydrolase isozyme L1(Homo sapiens (Human))
Mission Therapeutics
US Patent
LigandPNGBDBM445119((S)-N-(5-benzylthiazol-2-yl)-1-cyano-N-methylpyrro...)
Affinity DataIC50:  5.50E+3nM. Assay description: Dilution plates were prepared at 21 times the final concentration (2100 μM for a final concentration of 100 μM) in 50% DMSO in a 96-well po...
Ligand InfoPC cidPC sid
In DepthDetails US Patent
TargetUbiquitin carboxyl-terminal hydrolase isozyme L1(Homo sapiens (Human))
Mission Therapeutics
US Patent
LigandPNGBDBM445119((S)-N-(5-benzylthiazol-2-yl)-1-cyano-N-methylpyrro...)
Affinity DataIC50:  5.50E+3nM. Assay description: Dilution plates were prepared at 21 times the final concentration (2100 μM for a final concentration of 100 (μM) in 50% DMSO in a 96-well p...
Ligand InfoPC cidPC sid
In DepthDetails US Patent