BDBM445122 (S)-N-(4-(4- chlorophenyl)thiazol- 2-yl)-1-cyano-N- methylpyrrolidine-2- carboxamide::US10669234, Example 61::US11319287, Example 61
SMILES CN(C(=O)[C@@H]1CCCN1C#N)c1nc(cs1)-c1ccc(Cl)cc1
InChI Key InChIKey=NYHSLNVRVJOYFH-AWEZNQCLSA-N
Data  4 IC50
  Tab Delimited (TSV)   2D SDfile   Computed 3D by Vconf -m prep SDfile
Find this compound or compounds like it in BindingDB:
Activity Spreadsheet -- Enzyme Inhibition Constant Data from BindingDB
Found 4 hits for monomerid = 445122
TargetUbiquitin carboxyl-terminal hydrolase isozyme L1(Homo sapiens (Human))
Mission Therapeutics
US Patent
LigandPNGBDBM445122((S)-N-(4-(4- chlorophenyl)thiazol- 2-yl)-1-cyano-N...)
Affinity DataIC50:  5.50E+3nM. Assay description: Dilution plates were prepared at 21 times the final concentration (2100 μM for a final concentration of 100 (μM) in 50% DMSO in a 96-well p...
Ligand InfoPC cidPC sid
In DepthDetails US Patent
TargetUbiquitin carboxyl-terminal hydrolase 30(Homo sapiens (Human))
Mission Therapeutics
US Patent
LigandPNGBDBM445122((S)-N-(4-(4- chlorophenyl)thiazol- 2-yl)-1-cyano-N...)
Affinity DataIC50:  550nM. Assay description: Dilution plates were prepared at 21 times the final concentration (2100 μM for a final concentration of 100 μM) in 50% DMSO in a 96-well po...
Ligand InfoPC cidPC sid
In DepthDetails US Patent
TargetUbiquitin carboxyl-terminal hydrolase isozyme L1(Homo sapiens (Human))
Mission Therapeutics
US Patent
LigandPNGBDBM445122((S)-N-(4-(4- chlorophenyl)thiazol- 2-yl)-1-cyano-N...)
Affinity DataIC50:  5.50E+3nM. Assay description: Dilution plates were prepared at 21 times the final concentration (2100 μM for a final concentration of 100 μM) in 50% DMSO in a 96-well po...
Ligand InfoPC cidPC sid
In DepthDetails US Patent
TargetUbiquitin carboxyl-terminal hydrolase 30(Homo sapiens (Human))
Mission Therapeutics
US Patent
LigandPNGBDBM445122((S)-N-(4-(4- chlorophenyl)thiazol- 2-yl)-1-cyano-N...)
Affinity DataIC50:  550nM. Assay description: Dilution plates were prepared at 21 times the final concentration (2100 μM for a final concentration of 100 μM) in 50% DMSO in a 96-well po...
Ligand InfoPC cidPC sid
In DepthDetails US Patent