BDBM445137 (S)-2-(4-(2-Aminopyridin-4-yl)indoline-1-carbonyl)pyrrolidine-1-carbonitrile::US10669234, Example 76::US11319287, Example 76
SMILES CC(C)(C)OC(=O)N1CCC[C@H]1C(=O)N1CCc2c1cccc2-c1ccnc(N)c1
InChI Key InChIKey=FVXNFTFVFLVUAU-IBGZPJMESA-N
Data  2 IC50
  Tab Delimited (TSV)   2D SDfile   Computed 3D by Vconf -m prep SDfile
Find this compound or compounds like it in BindingDB:
Activity Spreadsheet -- Enzyme Inhibition Constant Data from BindingDB
Found 2 hits for monomerid = 445137
TargetUbiquitin carboxyl-terminal hydrolase isozyme L1(Homo sapiens (Human))
Mission Therapeutics
US Patent
LigandPNGBDBM445137((S)-2-(4-(2-Aminopyridin-4-yl)indoline-1-carbonyl)...)
Affinity DataIC50:  550nM. Assay description: Dilution plates were prepared at 21 times the final concentration (2100 μM for a final concentration of 100 μM) in 50% DMSO in a 96-well po...
Ligand InfoPC cidPC sid
In DepthDetails US Patent
TargetUbiquitin carboxyl-terminal hydrolase isozyme L1(Homo sapiens (Human))
Mission Therapeutics
US Patent
LigandPNGBDBM445137((S)-2-(4-(2-Aminopyridin-4-yl)indoline-1-carbonyl)...)
Affinity DataIC50:  550nM. Assay description: Dilution plates were prepared at 21 times the final concentration (2100 μM for a final concentration of 100 (μM) in 50% DMSO in a 96-well p...
Ligand InfoPC cidPC sid
In DepthDetails US Patent