BDBM445145 1-(Cyano-L-prolyl)-N-methyl-4-(1H-pyrrolo[2,3-b]pyridin-3-yl)indoline-6-carboxamide::US10669234, Example 89::US11319287, Example 89
SMILES CNC(=O)c1cc2N(CCc2c(c1)-c1c[nH]c2ncccc12)C(=O)[C@@H]1CCCN1C#N
InChI Key
Data  4 IC50
  Tab Delimited (TSV)   2D SDfile   Computed 3D by Vconf -m prep SDfile
Find this compound or compounds like it in BindingDB:
Activity Spreadsheet -- Enzyme Inhibition Constant Data from BindingDB
Found 4 hits for monomerid = 445145
TargetUbiquitin carboxyl-terminal hydrolase isozyme L1(Homo sapiens (Human))
Mission Therapeutics
US Patent
LigandPNGBDBM445145(1-(Cyano-L-prolyl)-N-methyl-4-(1H-pyrrolo[2,3-b]py...)
Affinity DataIC50:  550nM. Assay description: Dilution plates were prepared at 21 times the final concentration (2100 μM for a final concentration of 100 (μM) in 50% DMSO in a 96-well p...
Ligand InfoPC cidPC sid
In DepthDetails US Patent
TargetUbiquitin carboxyl-terminal hydrolase 30(Homo sapiens (Human))
Mission Therapeutics
US Patent
LigandPNGBDBM445145(1-(Cyano-L-prolyl)-N-methyl-4-(1H-pyrrolo[2,3-b]py...)
Affinity DataIC50:  5.50E+3nM. Assay description: Dilution plates were prepared at 21 times the final concentration (2100 μM for a final concentration of 100 μM) in 50% DMSO in a 96-well po...
Ligand InfoPC cidPC sid
In DepthDetails US Patent
TargetUbiquitin carboxyl-terminal hydrolase isozyme L1(Homo sapiens (Human))
Mission Therapeutics
US Patent
LigandPNGBDBM445145(1-(Cyano-L-prolyl)-N-methyl-4-(1H-pyrrolo[2,3-b]py...)
Affinity DataIC50:  550nM. Assay description: Dilution plates were prepared at 21 times the final concentration (2100 μM for a final concentration of 100 μM) in 50% DMSO in a 96-well po...
Ligand InfoPC cidPC sid
In DepthDetails US Patent
TargetUbiquitin carboxyl-terminal hydrolase 30(Homo sapiens (Human))
Mission Therapeutics
US Patent
LigandPNGBDBM445145(1-(Cyano-L-prolyl)-N-methyl-4-(1H-pyrrolo[2,3-b]py...)
Affinity DataIC50:  5.50E+3nM. Assay description: Dilution plates were prepared at 21 times the final concentration (2100 μM for a final concentration of 100 μM) in 50% DMSO in a 96-well po...
Ligand InfoPC cidPC sid
In DepthDetails US Patent