BDBM445162 (S)-2-(4-(6-aminopyrazin- 2-yl)indoline-1- carbonyl)pyrrolidine-1- carbonitrile::US10669234, Example 119::US11319287, Example 119
SMILES Nc1cncc(n1)-c1cccc2N(CCc12)C(=O)[C@@H]1CCCN1C#N
InChI Key InChIKey=YOGAXMPPMMXAEY-INIZCTEOSA-N
Data  2 IC50
  Tab Delimited (TSV)   2D SDfile   Computed 3D by Vconf -m prep SDfile
Find this compound or compounds like it in BindingDB:
Activity Spreadsheet -- Enzyme Inhibition Constant Data from BindingDB
Found 2 hits for monomerid = 445162
TargetUbiquitin carboxyl-terminal hydrolase isozyme L1(Homo sapiens (Human))
Mission Therapeutics
US Patent
LigandPNGBDBM445162((S)-2-(4-(6-aminopyrazin- 2-yl)indoline-1- carbony...)
Affinity DataIC50:  5.50E+3nM. Assay description: Dilution plates were prepared at 21 times the final concentration (2100 μM for a final concentration of 100 μM) in 50% DMSO in a 96-well po...
Ligand InfoPC cidPC sid
In DepthDetails US Patent
TargetUbiquitin carboxyl-terminal hydrolase isozyme L1(Homo sapiens (Human))
Mission Therapeutics
US Patent
LigandPNGBDBM445162((S)-2-(4-(6-aminopyrazin- 2-yl)indoline-1- carbony...)
Affinity DataIC50:  5.50E+3nM. Assay description: Dilution plates were prepared at 21 times the final concentration (2100 μM for a final concentration of 100 (μM) in 50% DMSO in a 96-well p...
Ligand InfoPC cidPC sid
In DepthDetails US Patent