BDBM445192 (S)-2-(5-(4-(methyl- sulfonyl)phenyl)isoindoline- 2-carbonyl)pyrrolidine- 1-carbonitrile::US10669234, Example 131::US11319287, Example 131
SMILES CS(=O)(=O)c1ccc(cc1)-c1ccc2CN(Cc2c1)C(=O)[C@@H]1CCCN1C#N
InChI Key InChIKey=XJORGKDALFSCCA-FQEVSTJZSA-N
Data  2 IC50
  Tab Delimited (TSV)   2D SDfile   Computed 3D by Vconf -m prep SDfile
Find this compound or compounds like it in BindingDB:
Activity Spreadsheet -- Enzyme Inhibition Constant Data from BindingDB
Found 2 hits for monomerid = 445192
TargetUbiquitin carboxyl-terminal hydrolase 30(Homo sapiens (Human))
Mission Therapeutics
US Patent
LigandPNGBDBM445192((S)-2-(5-(4-(methyl- sulfonyl)phenyl)isoindoline- ...)
Affinity DataIC50:  5.50E+3nM. Assay description: Dilution plates were prepared at 21 times the final concentration (2100 μM for a final concentration of 100 μM) in 50% DMSO in a 96-well po...
Ligand InfoPC cidPC sid
In DepthDetails US Patent
TargetUbiquitin carboxyl-terminal hydrolase 30(Homo sapiens (Human))
Mission Therapeutics
US Patent
LigandPNGBDBM445192((S)-2-(5-(4-(methyl- sulfonyl)phenyl)isoindoline- ...)
Affinity DataIC50:  5.50E+3nM. Assay description: Dilution plates were prepared at 21 times the final concentration (2100 μM for a final concentration of 100 μM) in 50% DMSO in a 96-well po...
Ligand InfoPC cidPC sid
In DepthDetails US Patent