BDBM445203 (S)-1-cyano-N-(4-(6-cyano-3-ethoxypyridin-2-yl)thiazol-2-yl)-N-methylpyrrolidine-2-carboxamide::US10669234, Example 142::US11319287, Example 142
SMILES CCOc1ccc(nc1-c1csc(n1)N(C)C(=O)[C@@H]1CCCN1C#N)C#N
InChI Key InChIKey=KFVZUBKAWMNHOI-AWEZNQCLSA-N
Data  2 IC50
  Tab Delimited (TSV)   2D SDfile   Computed 3D by Vconf -m prep SDfile
Find this compound or compounds like it in BindingDB:
Activity Spreadsheet -- Enzyme Inhibition Constant Data from BindingDB
Found 2 hits for monomerid = 445203
TargetUbiquitin carboxyl-terminal hydrolase 30(Homo sapiens (Human))
Mission Therapeutics
US Patent
LigandPNGBDBM445203((S)-1-cyano-N-(4-(6-cyano-3-ethoxypyridin-2-yl)thi...)
Affinity DataIC50: <100nM. Assay description: Dilution plates were prepared at 21 times the final concentration (2100 μM for a final concentration of 100 μM) in 50% DMSO in a 96-well po...
Ligand InfoPC cidPC sid
In DepthDetails US Patent
TargetUbiquitin carboxyl-terminal hydrolase 30(Homo sapiens (Human))
Mission Therapeutics
US Patent
LigandPNGBDBM445203((S)-1-cyano-N-(4-(6-cyano-3-ethoxypyridin-2-yl)thi...)
Affinity DataIC50: <100nM. Assay description: Dilution plates were prepared at 21 times the final concentration (2100 μM for a final concentration of 100 μM) in 50% DMSO in a 96-well po...
Ligand InfoPC cidPC sid
In DepthDetails US Patent