BDBM445310 (S)-3-(2-((1-(1-(4,4-difluorocyclohexyl)-1H-imidazol-4-yl)cyclopropyl)amino) pyrimidin-4-yl)-4-isopropyl-1-methylimidazolidine-2-one::US10682352, Compound 36
SMILES CC(C)[C@H]1CN(C)C(=O)N1c1ccnc(NC2(CC2)c2cn(cn2)C2CCC(F)(F)CC2)n1
InChI Key InChIKey=NJQVQADWGNMIBA-QGZVFWFLSA-N
Data  1 IC50
  Tab Delimited (TSV)   2D SDfile   Computed 3D by Vconf -m prep SDfile
Find this compound or compounds like it in BindingDB:
Activity Spreadsheet -- Enzyme Inhibition Constant Data from BindingDB
Found 1 hit for monomerid = 445310
TargetIsocitrate dehydrogenase [NADP] cytoplasmic(Homo sapiens (Human))
Shanghai Haihe Pharmaceutical
US Patent
LigandPNGBDBM445310((S)-3-(2-((1-(1-(4,4-difluorocyclohexyl)-1H-imidaz...)
Affinity DataIC50:  550nM. Assay description: Measurements were performed in a reaction volume of 15 uL using 384-well assay plates. Kinase enzyme, inhibitor, ATP and 1 uM peptide substrate were ...
Ligand InfoPC cidPC sid
In DepthDetails US Patent