BDBM445356 (S)-1-(3-cyclopropylphenyl)-4-(1-((4-(5-isopropyl-3-methyl-2-oxoimidazolidine-1-yl)pyrimidine-2-yl)amino)cyclopropyl)-1H-imidazole-5-carbonitrile::US10682352, Compound 69
SMILES CC(C)[C@H]1CN(C)C(=O)N1c1ccnc(NC2(CC2)c2ncn(c2Br)-c2cccc(c2)C2CC2)n1
InChI Key InChIKey=DETPGAMXWFHBJA-HXUWFJFHSA-N
Data  1 IC50
  Tab Delimited (TSV)   2D SDfile   Computed 3D by Vconf -m prep SDfile
Find this compound or compounds like it in BindingDB:
Activity Spreadsheet -- Enzyme Inhibition Constant Data from BindingDB
Found 1 hit for monomerid = 445356
TargetIsocitrate dehydrogenase [NADP] cytoplasmic(Homo sapiens (Human))
Shanghai Haihe Pharmaceutical
US Patent
LigandPNGBDBM445356((S)-1-(3-cyclopropylphenyl)-4-(1-((4-(5-isopropyl-...)
Affinity DataIC50:  550nM. Assay description: Measurements were performed in a reaction volume of 15 uL using 384-well assay plates. Kinase enzyme, inhibitor, ATP and 1 uM peptide substrate were ...
Ligand InfoPC cidPC sid
In DepthDetails US Patent