BDBM445360 (S)-3-(2-(((S)-1-(1-(4-chlorophenyl)-1H-imidazol-4-yl)ethyl)amino)pyrimidin-4-yl)-4-isopropyl-1-cyclopropylimidazolidine-2-one::US10682352, Compound 73
SMILES CC(C)[C@H]1CN(C2CC2)C(=O)N1c1ccnc(N[C@@H](C)c2cn(cn2)-c2ccc(Cl)cc2)n1
InChI Key InChIKey=IHFPWITVGSQVHH-HRAATJIYSA-N
Data  1 IC50
  Tab Delimited (TSV)   2D SDfile   Computed 3D by Vconf -m prep SDfile
Find this compound or compounds like it in BindingDB:
Activity Spreadsheet -- Enzyme Inhibition Constant Data from BindingDB
Found 1 hit for monomerid = 445360
TargetIsocitrate dehydrogenase [NADP] cytoplasmic(Homo sapiens (Human))
Shanghai Haihe Pharmaceutical
US Patent
LigandPNGBDBM445360((S)-3-(2-(((S)-1-(1-(4-chlorophenyl)-1H-imidazol-4...)
Affinity DataIC50:  550nM. Assay description: Measurements were performed in a reaction volume of 15 uL using 384-well assay plates. Kinase enzyme, inhibitor, ATP and 1 uM peptide substrate were ...
Ligand InfoPC cidPC sid
In DepthDetails US Patent