BDBM445367 (S)-3-(2-(((S)-1-(1-(4-chlorophenyl)-1H-imidazol-4-yl)ethyl)amino)-5-fluoropyrimidin-4-yl)-1-isopropyl-1-methylimidazolidine-2-one::US10682352, Compound 80
SMILES CC(C)[C@H]1CN(C)C(=O)N1c1nc(N[C@@H](C)c2cn(cn2)-c2ccc(Cl)cc2)ncc1F
InChI Key InChIKey=ZNZMGKGEQWIUAJ-IFXJQAMLSA-N
Data  1 IC50
  Tab Delimited (TSV)   2D SDfile   Computed 3D by Vconf -m prep SDfile
Find this compound or compounds like it in BindingDB:
Activity Spreadsheet -- Enzyme Inhibition Constant Data from BindingDB
Found 1 hit for monomerid = 445367
TargetIsocitrate dehydrogenase [NADP] cytoplasmic(Homo sapiens (Human))
Shanghai Haihe Pharmaceutical
US Patent
LigandPNGBDBM445367((S)-3-(2-(((S)-1-(1-(4-chlorophenyl)-1H-imidazol-4...)
Affinity DataIC50: <100nM. Assay description: Measurements were performed in a reaction volume of 15 uL using 384-well assay plates. Kinase enzyme, inhibitor, ATP and 1 uM peptide substrate were ...
Ligand InfoPC cidPC sid
In DepthDetails US Patent