BDBM445395 Compound (S)-4,4,-dideutero-5-isopropyl-1-(2-(((S)-1-(4-methyl-2′-(trifluoromethyl)-[3, 4′-bipyridyl]-6-yl)ethyl)amino)pyrimidin-4-yl)imidazolidine-2-one::US10682352, Compound 108
SMILES CC(C)[C@H]1CNC(=O)N1c1ccnc(N[C@@H](C)c2cc(C)c(cn2)-c2ccnc(c2)C(F)(F)F)n1
InChI Key InChIKey=BFHWAUNTEQELPY-HNAYVOBHSA-N
Data  1 IC50
  Tab Delimited (TSV)   2D SDfile   Computed 3D by Vconf -m prep SDfile
Find this compound or compounds like it in BindingDB:
Activity Spreadsheet -- Enzyme Inhibition Constant Data from BindingDB
Found 1 hit for monomerid = 445395
TargetIsocitrate dehydrogenase [NADP] cytoplasmic(Homo sapiens (Human))
Shanghai Haihe Pharmaceutical
US Patent
LigandPNGBDBM445395(Compound (S)-4,4,-dideutero-5-isopropyl-1-(2-(((S)...)
Affinity DataIC50:  550nM. Assay description: Measurements were performed in a reaction volume of 15 uL using 384-well assay plates. Kinase enzyme, inhibitor, ATP and 1 uM peptide substrate were ...
Ligand InfoPC cidPC sid
In DepthDetails US Patent