BDBM44549 3-Ethyl-2-(2-phenylamino-vinyl)-benzooxazol-3-ium::MLS000568350::N-[(E)-2-(3-ethyl-1,3-benzoxazol-3-ium-2-yl)ethenyl]aniline;iodide::SMR000173859::[(E)-2-(3-ethyl-1,3-benzoxazol-3-ium-2-yl)vinyl]-phenyl-amine;iodide::cid_6441916
SMILES CC[n+]1c(CC=Nc2ccccc2)oc2ccccc12
InChI Key InChIKey=WSXRUGHMYMCUQX-UHFFFAOYSA-N
Data  1 IC50  1 EC50
  Tab Delimited (TSV)   2D SDfile   Computed 3D by Vconf -m prep SDfile
Find this compound or compounds like it in BindingDB:
Activity Spreadsheet -- Enzyme Inhibition Constant Data from BindingDB
Found 2 hits for monomerid = 44549
TargetHeat shock factor protein 1(Mus musculus)
Broad Institute
Curated by PubChem BioAssay
LigandPNGBDBM44549(3-Ethyl-2-(2-phenylamino-vinyl)-benzooxazol-3-ium ...)
Affinity DataEC50: >1.95E+5nM. Assay description: Keywords: Heat Shock Factor-1 (HSF-1), Stress Response, MG132, NIH3T3, Luminescence Assay Overview: Modified NIH3T3, transformed to express firefly...
In DepthDetails PCBioAssay
TargetProtein Rev [8-24](Human immunodeficiency virus 1)
The Scripps Research Institute Molecular Screening Center
Curated by PubChem BioAssay
LigandPNGBDBM44549(3-Ethyl-2-(2-phenylamino-vinyl)-benzooxazol-3-ium ...)
Affinity DataIC50:  5.66E+3nM. Assay description: Source (MLSCN Center Name): The Scripps Research Institute Molecular Screening Center Center Affiliation: The Scripps Research Institute, TSRI Assay ...
In DepthDetails PCBioAssay