BDBM445497 US10683287, Example 23
SMILES CC(F)(F)COc1cnc(C(=O)Nc2cccc(n2)[C@]2(C)CO[C@](C)(C(N)=N2)C(F)(F)F)c(N)n1
InChI Key InChIKey=LCFXPMWBUJPQOA-PKOBYXMFSA-N
Data  2 IC50
  Tab Delimited (TSV)   2D SDfile   Computed 3D by Vconf -m prep SDfile
Find this compound or compounds like it in BindingDB:
Activity Spreadsheet -- Enzyme Inhibition Constant Data from BindingDB
Found 2 hits for monomerid = 445497
TargetBeta-secretase 2(Homo sapiens (Human))
Novartis
US Patent
LigandPNGBDBM445497(US10683287, Example 23)
Affinity DataIC50: >1.00E+4nM. Assay description: Recombinant BACE-2 (extracellular domain, expressed in baculovirus and purified using standard methods) at 0.1 to 10 nM concentrations is incubated w...
Ligand InfoPC cidPC sid
In DepthDetails US Patent
TargetBeta-secretase 1(Homo sapiens (Human))
Novartis
US Patent
LigandPNGBDBM445497(US10683287, Example 23)
Affinity DataIC50:  1.20E+3nM. Assay description: Recombinant BACE-1 (extracellular domain, expressed in baculovirus and purified using standard methods) at 0.1 to 10 nM concentrations is incubated w...
Ligand InfoPC cidPC sid
In DepthDetails US Patent