BDBM445504 US10683289, Example 21
SMILES COCCN1Cc2cc(F)c(cc2S1(=O)=O)C(=O)Nc1cccc(n1)-c1nnnn1[C@H](C)CO
InChI Key InChIKey=XYHJPFLIDGLAIR-GFCCVEGCSA-N
Data  1 IC50
  Tab Delimited (TSV)   2D SDfile   Computed 3D by Vconf -m prep SDfile
Find this compound or compounds like it in BindingDB:
Activity Spreadsheet -- Enzyme Inhibition Constant Data from BindingDB
Found 1 hit for monomerid = 445504
TargetMitogen-activated protein kinase kinase kinase 5(Homo sapiens (Human))
Enanta Pharmaceuticals
US Patent
LigandPNGBDBM445504(US10683289, Example 21)
Affinity DataIC50: <1nM. Assay description: ASK1 was purchased from Thermofisher (Catalogue # PV4011), ATP was purchased from Sigma (Catalogue # A7699), HTRF® KinEASE™ Assay System was obtained...
Ligand InfoPC cidPC sid
In DepthDetails US Patent