BDBM445525 2-[7-(Dimethyl-1,2-oxazol-4-yl)-6-fluoro-5-[(S)-oxan-4-yl(phenyl)methyl]-5H-pyrido[3,2-b]indol-3-yl]propan-2-ol and 2-[7-(dimethyl-1,2-oxazol-4-yl)-8-fluoro-5-[(S)-oxan-4-yl(phenyl)methyl]-5H-pyrido[3,2-b]indol-3-yl]propan-2-ol::US10683290, Example 17::US10683290, Example 18
SMILES Cc1noc(C)c1-c1cc2n([C@@H](C3CCOCC3)c3ccccc3)c3cc(cnc3c2cc1F)C(C)(C)O
InChI Key InChIKey=DAQLHJDJDCDNQT-SSEXGKCCSA-N
Data  2 IC50
  Tab Delimited (TSV)   2D SDfile   Computed 3D by Vconf -m prep SDfile
Find this compound or compounds like it in BindingDB:
Activity Spreadsheet -- Enzyme Inhibition Constant Data from BindingDB
Found 2 hits for monomerid = 445525
TargetBromodomain-containing protein 4 [1-477](Homo sapiens (Human))
Bristol-Myers Squibb
US Patent
LigandPNGBDBM445525(2-[7-(Dimethyl-1,2-oxazol-4-yl)-6-fluoro-5-[(S)-ox...)
Affinity DataIC50: <5nM. Assay description: All assay components were dissolved in buffer composition 20 mM Hepes pH 7.5, 150 mM NaCl, 5 mM DTT, 0.005% Tween 20, and 100 ug/ml BSA for BRD4 (1-4...
Ligand InfoPC cidPC sid
In DepthDetails US Patent
TargetBromodomain-containing protein 4 [1-477](Homo sapiens (Human))
Bristol-Myers Squibb
US Patent
LigandPNGBDBM445525(2-[7-(Dimethyl-1,2-oxazol-4-yl)-6-fluoro-5-[(S)-ox...)
Affinity DataIC50: <5nM. Assay description: All assay components were dissolved in buffer composition 20 mM Hepes pH 7.5, 150 mM NaCl, 5 mM DTT, 0.005% Tween 20, and 100 ug/ml BSA for BRD4 (1-4...
Ligand InfoPC cidPC sid
In DepthDetails US Patent