BDBM445579 US10683290, Example 72
SMILES Cc1nnn(C)c1-c1ccc2c(c1)n([C@@H](C1CCOCC1)c1ncccc1F)c1cc(cnc21)C(C)(C)O
InChI Key InChIKey=ZTXMSECIVHKSIK-NDEPHWFRSA-N
Data  1 IC50
  Tab Delimited (TSV)   2D SDfile   Computed 3D by Vconf -m prep SDfile
Find this compound or compounds like it in BindingDB:
Activity Spreadsheet -- Enzyme Inhibition Constant Data from BindingDB
Found 1 hit for monomerid = 445579
TargetBromodomain-containing protein 4 [1-477](Homo sapiens (Human))
Bristol-Myers Squibb
US Patent
LigandPNGBDBM445579(US10683290, Example 72)
Affinity DataIC50: <1nM. Assay description: All assay components were dissolved in buffer composition 20 mM Hepes pH 7.5, 150 mM NaCl, 5 mM DTT, 0.005% Tween 20, and 100 ug/ml BSA for BRD4 (1-4...
Ligand InfoPC cidPC sid
In DepthDetails US Patent