BDBM445594 US10683291, Example 5
SMILES FC(F)(F)c1cc(Cl)c2nc(cn2c1)-c1nc(no1)-c1cc(Cl)c(OC2CCC(=O)NC2)cc1Cl
InChI Key InChIKey=HNRWGYDMTRPLCQ-UHFFFAOYSA-N
Data  1 EC50
  Tab Delimited (TSV)   2D SDfile   Computed 3D by Vconf -m prep SDfile
Find this compound or compounds like it in BindingDB:
Activity Spreadsheet -- Enzyme Inhibition Constant Data from BindingDB
Found 1 hit for monomerid = 445594
TargetSphingosine 1-phosphate receptor 1(Homo sapiens (Human))
Oppilan Pharma
US Patent
LigandPNGBDBM445594(US10683291, Example 5)
Affinity DataEC50: <1.00E+3nM. Assay description: S1P1 membrane is prepared from CHO-K1 Gαqi5 cells expression full-length human S1P1. Scintillation proximity assay (SPA) is performed by incubat...
Ligand InfoPC cidPC sid
In DepthDetails US Patent