BDBM445624 US10683294, Compound 1.029::US11479553, Compound 1.029
SMILES CCc1cccc(CC)c1-n1nc2c(CN(Cc3ccccc3C(F)(F)F)C2(C)C)c1-c1ccc(F)c2[nH]ccc12
InChI Key InChIKey=GAWOCFACRWGCLQ-UHFFFAOYSA-N
Data  2 IC50
  Tab Delimited (TSV)   2D SDfile   Computed 3D by Vconf -m prep SDfile
Find this compound or compounds like it in BindingDB:
Activity Spreadsheet -- Enzyme Inhibition Constant Data from BindingDB
Found 2 hits for monomerid = 445624
TargetC5a anaphylatoxin chemotactic receptor 1(Homo sapiens (Human))
Chemocentryx
US Patent
LigandPNGBDBM445624(US10683294, Compound 1.029 | US11479553, Compound ...)
Affinity DataIC50:  27.5nM. Assay description: To evaluate small organic molecules that prevent the C5a receptor from binding ligand, an assay was employed that detected radioactive ligand (i.e, C...
Ligand InfoPC cidPC sid
In DepthDetails US Patent
TargetC5a anaphylatoxin chemotactic receptor 1(Homo sapiens (Human))
Chemocentryx
US Patent
LigandPNGBDBM445624(US10683294, Compound 1.029 | US11479553, Compound ...)
Affinity DataIC50:  27.5nM. Assay description: cAMP treated U937 cells expressing C5aR were centrifuged and resuspended in assay buffer (20 mM HEPES pH 7.1, 140 mM NaCl, 1 mM CaCl2, 5 mM MgCl2, an...
Ligand InfoPC cidPC sid
In DepthDetails US Patent