BDBM445747 US10669240, Compound 43
SMILES O=C(Nc1cccc2cccnc12)c1n[nH]c2ccc(cc12)-c1cccnc1
InChI Key InChIKey=CCYLLLQTWUAUOU-UHFFFAOYSA-N
Data  2 IC50  1 EC50
  Tab Delimited (TSV)   2D SDfile   Computed 3D by Vconf -m prep SDfile
Find this compound or compounds like it in BindingDB:
Activity Spreadsheet -- Enzyme Inhibition Constant Data from BindingDB
Found 3 hits for monomerid = 445747
TargetProto-oncogene Wnt-1(Homo sapiens (human))
Samumed
US Patent
LigandPNGBDBM445747(US10669240, Compound 43)
Affinity DataIC50:  21nM. Assay description: Reporter cell lines were generated by stably transducing cells of cancer cell lines (e.g., colon cancer) with a lentiviral construct that include a W...
Ligand InfoPC cidPC sid
In DepthDetails US Patent
TargetPulmonary surfactant-associated protein A1(Human)
Samumed
US Patent
LigandPNGBDBM445747(US10669240, Compound 43)
Affinity DataIC50:  3.44E+3nM. Assay description: Each compound was dissolved in DMSO as a 10 mM stock and used to prepare compound source plates. Serial dilution (1:3, 8-point dose-response curves f...
Ligand InfoPC cidPC sid
In DepthDetails US Patent
TargetDual specificity tyrosine-phosphorylation-regulated kinase 1A(Homo sapiens (Human))
Samumed
US Patent
LigandPNGBDBM445747(US10669240, Compound 43)
Affinity DataEC50:  2.20E+3nM. Assay description: SH-SY5Y cells are cultured in DMEM/F-12 medium supplemented with 15% FBS, Non-essential Amino Acid and Penicillin/Streptamycin. Two days before treat...
Ligand InfoPC cidPC sid
In DepthDetails US Patent