BDBM445952 US10669246, Example 4::US10968188, Example 4
SMILES Cc1ccncc1-c1ccc2nc(NC(=O)[C@@H]3C[C@@H]3F)sc2c1
InChI Key InChIKey=SFFSWMIVCZTNBC-YPMHNXCESA-N
Data  1 KI  10 IC50
  Tab Delimited (TSV)   2D SDfile   Computed 3D by Vconf -m prep SDfile
Find this compound or compounds like it in BindingDB:
Activity Spreadsheet -- Enzyme Inhibition Constant Data from BindingDB
Found 11 hits for monomerid = 445952
TargetMast/stem cell growth factor receptor Kit(Homo sapiens (Human))
1St Biotherapeutics
US Patent
LigandPNGBDBM445952(US10669246, Example 4 | US10968188, Example 4)
Affinity DataKi: >1.00E+4nM. Assay description: c-Kit kinase activity was measured by Promega's ADP-Glo™ Assay. In this assay, Recombinant human c-Kit (100 ng) is incubated with 5 μL of co...
In DepthDetails US Patent
TargetTyrosine-protein kinase ABL1(Homo sapiens (Human))
1St Biotherapeutics
US Patent
LigandPNGBDBM445952(US10669246, Example 4 | US10968188, Example 4)
Affinity DataIC50:  4.10nM. Assay description: ADP-Glo assay kit was purchased from Promega. Magnesium chloride (MgCl2), bovine serum albumin (BSA), ethylene glycol-bis(β-aminoethyl ether)-N,...
In DepthDetails US Patent
TargetMast/stem cell growth factor receptor Kit(Homo sapiens (Human))
1St Biotherapeutics
US Patent
LigandPNGBDBM445952(US10669246, Example 4 | US10968188, Example 4)
Affinity DataIC50: >1.00E+4nM. Assay description: ADP-Glo assay kit was purchased from Promega. Magnesium chloride (MgCl2), Manganese(II) chloride (MnCl2), Bovine serum albumin (BSA) and dimethylsulf...
In DepthDetails US Patent
TargetPlatelet-derived growth factor receptor alpha(Homo sapiens (Human))
1St Biotherapeutics
US Patent
LigandPNGBDBM445952(US10669246, Example 4 | US10968188, Example 4)
Affinity DataIC50:  1.97E+3nM. Assay description: ADP-Glo assay kit was purchased from Promega. Magnesium chloride (MgCl2), Bovine serum albumin (BSA) and dimethylsulfoxide (DMSO) were purchased from...
In DepthDetails US Patent
TargetTyrosine-protein kinase ABL1(Homo sapiens (Human))
1St Biotherapeutics
US Patent
LigandPNGBDBM445952(US10669246, Example 4 | US10968188, Example 4)
Affinity DataIC50:  4.10nM. Assay description: c-abl kinase activity was measured by Promega's ADP-Glo™ Assay. In this assay, His-tagged recombinant human ABL1 (0.25 ng/μl) is incubated w...
In DepthDetails US Patent
TargetMast/stem cell growth factor receptor Kit(Homo sapiens (Human))
1St Biotherapeutics
US Patent
LigandPNGBDBM445952(US10669246, Example 4 | US10968188, Example 4)
Affinity DataIC50:  1.98E+3nM. Assay description: Inhibition of recombinant human c-Kit assessed as luminescence using poly (4:1 Glu, Tyr) peptide as substrate incubated for 2 hrs by ADP-Glo assay
In DepthDetails ArticlePubMed
TargetPlatelet-derived growth factor receptor alpha(Homo sapiens (Human))
1St Biotherapeutics
US Patent
LigandPNGBDBM445952(US10669246, Example 4 | US10968188, Example 4)
Affinity DataIC50:  1.97E+3nM. Assay description: PDGFRα kinase activity was measured by Promega's ADP-Glo™ Assay. In this assay, Recombinant human PDGFRα (40 ng) is incubated with 5 &#...
In DepthDetails US Patent
TargetTyrosine-protein kinase ABL1(Homo sapiens (Human))
1St Biotherapeutics
US Patent
LigandPNGBDBM445952(US10669246, Example 4 | US10968188, Example 4)
Affinity DataIC50:  5.10nM. Assay description: Inhibition of recombinant human His-tagged c-Abl kinase assessed as luminescence incubated for 30 mins by ADP-Glo assay
In DepthDetails ArticlePubMed
TargetPlatelet-derived growth factor receptor alpha(Homo sapiens (Human))
1St Biotherapeutics
US Patent
LigandPNGBDBM445952(US10669246, Example 4 | US10968188, Example 4)
Affinity DataIC50:  9.45E+3nM. Assay description: Inhibition of recombinant human PDGFRalpha assessed as luminescence using poly (4:1 Glu, Tyr) peptide as substrate incubated for 1 hr by ADP-Glo assa...
In DepthDetails ArticlePubMed
TargetTyrosine-protein kinase ABL1(Homo sapiens (Human))
1St Biotherapeutics
US Patent
LigandPNGBDBM445952(US10669246, Example 4 | US10968188, Example 4)
Affinity DataIC50:  4.10nM. Assay description: ADP-Glo assay kit was purchased from Promega. Magnesium chloride (MgCl2), bovine serum albumin (BSA), ethylene glycol-bis(β-aminoethyl ether)-N,...
In DepthDetails US Patent
TargetTyrosine-protein kinase ABL1(Homo sapiens (Human))
1St Biotherapeutics
US Patent
LigandPNGBDBM445952(US10669246, Example 4 | US10968188, Example 4)
Affinity DataIC50:  4.10nM. Assay description: c-abl kinase activity was measured by Promega's ADP-Glo™ Assay. In this assay, His-tagged recombinant human ABL1 (0.25 ng/μl) is incubated w...
In DepthDetails US Patent