BDBM445977 US10669246, Example 30
SMILES Cc1cccc(F)c1-c1ccc2sc(NC(=O)C3CC3)nc2c1
InChI Key InChIKey=CLHQUJFCSXEMJN-UHFFFAOYSA-N
Data  1 IC50
  Tab Delimited (TSV)   2D SDfile   Computed 3D by Vconf -m prep SDfile
Find this compound or compounds like it in BindingDB:
Activity Spreadsheet -- Enzyme Inhibition Constant Data from BindingDB
Found 1 hit for monomerid = 445977
TargetTyrosine-protein kinase ABL1(Homo sapiens (Human))
1St Biotherapeutics
US Patent
LigandPNGBDBM445977(US10669246, Example 30)
Affinity DataIC50: >2.00E+3nM. Assay description: ADP-Glo assay kit was purchased from Promega. Magnesium chloride (MgCl2), bovine serum albumin (BSA), ethylene glycol-bis(β-aminoethyl ether)-N,...
Ligand InfoPC cidPC sid
In DepthDetails US Patent