BDBM446004 US10669246, Example 55::US10968188, Example 55
SMILES COc1ccncc1-c1ccc2nc(NC(=O)[C@@H]3C[C@@H]3F)sc2c1
InChI Key InChIKey=RYDXEOCUWPNWBT-PWSUYJOCSA-N
Data  3 IC50
  Tab Delimited (TSV)   2D SDfile   Computed 3D by Vconf -m prep SDfile
Find this compound or compounds like it in BindingDB:
Activity Spreadsheet -- Enzyme Inhibition Constant Data from BindingDB
Found 3 hits for monomerid = 446004
TargetTyrosine-protein kinase ABL1(Homo sapiens (Human))
1St Biotherapeutics
US Patent
LigandPNGBDBM446004(US10669246, Example 55 | US10968188, Example 55)
Affinity DataIC50:  5.90nM. Assay description: ADP-Glo assay kit was purchased from Promega. Magnesium chloride (MgCl2), bovine serum albumin (BSA), ethylene glycol-bis(β-aminoethyl ether)-N,...
Ligand InfoPC cidPC sid
In DepthDetails US Patent
TargetTyrosine-protein kinase ABL1(Homo sapiens (Human))
1St Biotherapeutics
US Patent
LigandPNGBDBM446004(US10669246, Example 55 | US10968188, Example 55)
Affinity DataIC50:  6.10nM. Assay description: Inhibition of recombinant human His-tagged c-Abl kinase assessed as luminescence incubated for 30 mins by ADP-Glo assay
Ligand InfoPC cidPC sid
In DepthDetails ArticlePubMed
TargetTyrosine-protein kinase ABL1(Homo sapiens (Human))
1St Biotherapeutics
US Patent
LigandPNGBDBM446004(US10669246, Example 55 | US10968188, Example 55)
Affinity DataIC50:  5.90nM. Assay description: c-abl kinase activity was measured by Promega's ADP-Glo™ Assay. In this assay, His-tagged recombinant human ABL1 (0.25 ng/μl) is incubated w...
Ligand InfoPC cidPC sid
In DepthDetails US Patent