BDBM446026 US10669246, Example 77::US10968188, Example 77
SMILES Cc1ccc2[nH]ccc2c1-c1ccc2nc(NC(=O)[C@@H]3C[C@@H]3F)sc2c1
InChI Key
Data  2 IC50
  Tab Delimited (TSV)   2D SDfile   Computed 3D by Vconf -m prep SDfile
Find this compound or compounds like it in BindingDB:
Activity Spreadsheet -- Enzyme Inhibition Constant Data from BindingDB
Found 2 hits for monomerid = 446026
TargetTyrosine-protein kinase ABL1(Homo sapiens (Human))
1St Biotherapeutics
US Patent
LigandPNGBDBM446026(US10669246, Example 77 | US10968188, Example 77)
Affinity DataIC50:  1.60nM. Assay description: c-abl kinase activity was measured by Promega's ADP-Glo™ Assay. In this assay, His-tagged recombinant human ABL1 (0.25 ng/μl) is incubated w...
Ligand InfoPC cidPC sid
In DepthDetails US Patent
TargetTyrosine-protein kinase ABL1(Homo sapiens (Human))
1St Biotherapeutics
US Patent
LigandPNGBDBM446026(US10669246, Example 77 | US10968188, Example 77)
Affinity DataIC50:  1.60nM. Assay description: ADP-Glo assay kit was purchased from Promega. Magnesium chloride (MgCl2), bovine serum albumin (BSA), ethylene glycol-bis(β-aminoethyl ether)-N,...
Ligand InfoPC cidPC sid
In DepthDetails US Patent