BDBM446270 US10669268, Example 15.65
SMILES O=C(CCc1ccc(cc1)-c1ccccc1)N1C[C@@H]2CN(C[C@H]2C1)C(=O)c1ccc2[nH]nnc2c1
InChI Key
Data  1 IC50
  Tab Delimited (TSV)   2D SDfile   Computed 3D by Vconf -m prep SDfile
Find this compound or compounds like it in BindingDB:
Activity Spreadsheet -- Enzyme Inhibition Constant Data from BindingDB
Found 1 hit for monomerid = 446270
TargetAtaxin-1(Homo sapiens (Human))
Hoffmann-La Roche
US Patent
LigandPNGBDBM446270(US10669268, Example 15.65)
Affinity DataIC50:  3nM. Assay description: ATX inhibition was measured by a fluorescence quenching assay using a specifically labeled substrate analogue (MR121 substrate). To obtain this MR121...
Ligand InfoPC cidPC sid
In DepthDetails US Patent