BDBM44631 5-bicyclo[2.2.1]hept-2-enecarboxylic acid [2-[(2,2-difluoro-1,3-benzodioxol-5-yl)amino]-2-oxoethyl] ester::MLS000055933::SMR000064475::[2-[(2,2-difluoro-1,3-benzodioxol-5-yl)amino]-2-oxoethyl] bicyclo[2.2.1]hept-2-ene-5-carboxylate::[2-[[2,2-bis(fluoranyl)-1,3-benzodioxol-5-yl]amino]-2-oxidanylidene-ethyl] bicyclo[2.2.1]hept-2-ene-5-carboxylate::bicyclo[2.2.1]hept-2-ene-5-carboxylic acid [2-[(2,2-difluoro-1,3-benzodioxol-5-yl)amino]-2-keto-ethyl] ester::cid_2998684
SMILES [H]C12CC(C(=O)OCC(=O)Nc3ccc4OC(F)(F)Oc4c3)C([H])(C1)C=C2
InChI Key InChIKey=YMTWNUQMSIPQAH-UHFFFAOYSA-N
Data  2 EC50
  Tab Delimited (TSV)   2D SDfile   Computed 3D by Vconf -m prep SDfile
Find this compound or compounds like it in BindingDB:
Activity Spreadsheet -- Enzyme Inhibition Constant Data from BindingDB
Found 2 hits for monomerid = 44631
TargetHeat shock factor protein 1(Mus musculus)
Broad Institute
Curated by PubChem BioAssay
LigandPNGBDBM44631(5-bicyclo[2.2.1]hept-2-enecarboxylic acid [2-[(2,2...)
Affinity DataEC50: >2.60E+5nM. Assay description: Keywords: Heat Shock Factor-1 (HSF-1), Stress Response, MG132, NIH3T3, Luminescence Assay Overview: Confirmation testing of small molecules identifie...
In DepthDetails PCBioAssay
TargetMultidrug resistance-associated protein 1(Homo sapiens (Human))
Srmlsc
Curated by PubChem BioAssay
LigandPNGBDBM44631(5-bicyclo[2.2.1]hept-2-enecarboxylic acid [2-[(2,2...)
Affinity DataEC50:  6.54E+3nM. Assay description: Southern Research Molecular Libraries Screening Center (SRMLSC) Southern Research Institute (Birmingham, Alabama) NIH Molecular Libraries Screening C...
In DepthDetails PCBioAssay