BDBM44645 5-(2,5-dimethoxyphenyl)-N-[3,5-dimethyl-1-(2-methylbenzyl)-1H-pyrazol-4-yl]isoxazole-3-carboxamide::5-(2,5-dimethoxyphenyl)-N-[3,5-dimethyl-1-(2-methylbenzyl)pyrazol-4-yl]isoxazole-3-carboxamide::5-(2,5-dimethoxyphenyl)-N-[3,5-dimethyl-1-[(2-methylphenyl)methyl]-4-pyrazolyl]-3-isoxazolecarboxamide::5-(2,5-dimethoxyphenyl)-N-[3,5-dimethyl-1-[(2-methylphenyl)methyl]pyrazol-4-yl]-1,2-oxazole-3-carboxamide::MLS000087193::SMR000023416::cid_3237838
SMILES COc1ccc(OC)c(c1)-c1cc(no1)C(=O)Nc1c(C)nn(Cc2ccccc2C)c1C
InChI Key InChIKey=ADHULCIFUGVWPL-UHFFFAOYSA-N
Data  1 EC50
  Tab Delimited (TSV)   2D SDfile   Computed 3D by Vconf -m prep SDfile
Find this compound or compounds like it in BindingDB:
Activity Spreadsheet -- Enzyme Inhibition Constant Data from BindingDB
Found 1 hit for monomerid = 44645
TargetMultidrug resistance-associated protein 1(Homo sapiens (Human))
Srmlsc
Curated by PubChem BioAssay
LigandPNGBDBM44645(5-(2,5-dimethoxyphenyl)-N-[3,5-dimethyl-1-(2-methy...)
Affinity DataEC50:  3.49E+3nM. Assay description: Southern Research Molecular Libraries Screening Center (SRMLSC) Southern Research Institute (Birmingham, Alabama) NIH Molecular Libraries Screening C...
In DepthDetails PCBioAssay