BDBM446481 (R)-1-((7-cyano-2-(3′-(6-(difluoromethyl)-3-(((R)-3-hydroxypyrrolidin-1-yl)methyl)-1,7-naphthyridin-8-ylamino)-2,2′-dimethylbiphenyl-3-yl)benzo[d]oxazol-5-yl)methyl)-3-methylpyrrolidine-3-carboxylic Acid::US10669271, Example 34::US11124511, Example 34
SMILES Cc1c(Nc2nc(cc3cc(CN4CC[C@@H](O)C4)cnc23)C(F)F)cccc1-c1cccc(-c2nc3cc(CN4CC[C@](C)(C4)C(O)=O)cc(C#N)c3o2)c1C
InChI Key InChIKey=LLCKWXCPDAUVGI-QHKNHCAJSA-N
Data  2 IC50  1 EC50
  Tab Delimited (TSV)   2D SDfile   Computed 3D by Vconf -m prep SDfile
Find this compound or compounds like it in BindingDB:
Activity Spreadsheet -- Enzyme Inhibition Constant Data from BindingDB
Found 3 hits for monomerid = 446481
TargetProgrammed cell death 1 ligand 1 [19-238]/protein 1 [25-167](Homo sapiens (Human))
Incyte
US Patent
LigandPNGBDBM446481((R)-1-((7-cyano-2-(3′-(6-(difluoromethyl)-3-...)
Affinity DataIC50: <10nM. Assay description: The assays were conducted in a standard black 384-well polystyrene plate with a final volume of 20 μL. Inhibitors were first serially diluted in...
Ligand InfoPC cidPC sid
In DepthDetails US Patent
TargetProgrammed cell death 1 ligand 1 [19-238]/protein 1 [25-167](Homo sapiens (Human))
Incyte
US Patent
LigandPNGBDBM446481((R)-1-((7-cyano-2-(3′-(6-(difluoromethyl)-3-...)
Affinity DataIC50: <10nM. Assay description: The assays were conducted in a standard black 384-well polystyrene plate with a final volume of 20 μL. Inhibitors were first serially diluted in...
Ligand InfoPC cidPC sid
In DepthDetails US Patent
TargetNuclear factor NF-kappa-B p105 subunit(Homo sapiens (Human))
Incyte
US Patent
LigandPNGBDBM446481((R)-1-((7-cyano-2-(3′-(6-(difluoromethyl)-3-...)
Affinity DataEC50: <10nM. Assay description: PD-L1 aAPC/CHO-Klcells (Promega) were maintained in F-12 medium with addition of 10% FBS, 200 μg/ml Hygromycin B, 250 μg/ml Geneticin (G418...
Ligand InfoPC cidPC sid
In DepthDetails US Patent