BDBM446505 11-((2-(dimethylamino)ethoxy)imino)-9-fluoropyrido[2′,3′:4,5]pyrimido[1,2-α]indol-5(11H)-one::US10669273, Compound CY-1-19
SMILES CN(C)CCON=C1c2cc(F)ccc2-n2c1nc1ncccc1c2=O
InChI Key InChIKey=ILHZLVPMCCBOPA-PXLXIMEGSA-N
Data  1 IC50
  Tab Delimited (TSV)   2D SDfile   Computed 3D by Vconf -m prep SDfile
Find this compound or compounds like it in BindingDB:
Activity Spreadsheet -- Enzyme Inhibition Constant Data from BindingDB
Found 1 hit for monomerid = 446505
TargetIndoleamine 2,3-dioxygenase 1(Homo sapiens (Human))
Peking University
US Patent
LigandPNGBDBM446505(11-((2-(dimethylamino)ethoxy)imino)-9-fluoropyrido...)
Affinity DataIC50:  550nM. Assay description: Experimental method: IDO-1 can oxidatively cleave the indole ring of tryptophan to form N-formylkynurenine. Referring to the method in the literature...
Ligand InfoPC cidPC sid
In DepthDetails US Patent