BDBM446535 CHEM-US-00068::US10669285, Example 5
SMILES FC(F)(F)Oc1ccc(COC(=O)N2CCc3cc(nn3CC2)C(=O)N2CCc3[nH]nnc3C2)cc1
InChI Key InChIKey=RHVPVDFZBJWINL-UHFFFAOYSA-N
Data  1 IC50
  Tab Delimited (TSV)   2D SDfile   Computed 3D by Vconf -m prep SDfile
Find this compound or compounds like it in BindingDB:
Activity Spreadsheet -- Enzyme Inhibition Constant Data from BindingDB
Found 1 hit for monomerid = 446535
TargetAtaxin-1(Homo sapiens (Human))
Hoffmann-La Roche
US Patent
LigandPNGBDBM446535(CHEM-US-00068 | US10669285, Example 5)
Affinity DataIC50:  2nM. Assay description: ATX inhibition was measured by a fluorescence quenching assay using a specifically labeled substrate analogue (MR121 substrate). To obtain this MR121...
Ligand InfoPC cidPC sid
In DepthDetails US Patent