BDBM446555 7-(2-Chloro-4-fluorophenyl)-N2-(3-fluoro-4-(4-methyl-1H-imidazol-1-yl)phenyl)-N4,5,5-trimethyl-6,7-dihydro-5H-pyrrolo[2,3-d]pyrimidine-2,4-diamine::US10669276, Example 45
SMILES CNc1nc(Nc2ccc(c(F)c2)-n2cnc(C)c2)nc2N(CC(C)(C)c12)c1ccc(F)cc1Cl
InChI Key InChIKey=GOVSZVZGCADIBE-UHFFFAOYSA-N
Data  1 EC50
  Tab Delimited (TSV)   2D SDfile   Computed 3D by Vconf -m prep SDfile
Find this compound or compounds like it in BindingDB:
Activity Spreadsheet -- Enzyme Inhibition Constant Data from BindingDB
Found 1 hit for monomerid = 446555
TargetAmyloid-beta precursor protein [672-713](Homo sapiens (Human))
Hoffmann-La Roche
US Patent
LigandPNGBDBM446555(7-(2-Chloro-4-fluorophenyl)-N2-(3-fluoro-4-(4-meth...)
Affinity DataEC50:  4nM. Assay description: Human neuroglioma H4 cells overexpressing human APP695 with the Swedish double mutation (K595N/M596L) were plated at 30,000 cells/well/100 μl in...
Ligand InfoPC cidPC sid
In DepthDetails US Patent