BDBM446606 US10669289, Compound 13
SMILES CN(CC(=O)N[C@@H](Cc1ccc(C)cc1C)B(O)O)C(=O)\C=C\Cl
InChI Key InChIKey=GDYXWOQMQLGINM-UZYOAWRESA-N
Data  2 IC50
  Tab Delimited (TSV)   2D SDfile   Computed 3D by Vconf -m prep SDfile
Find this compound or compounds like it in BindingDB:
Activity Spreadsheet -- Enzyme Inhibition Constant Data from BindingDB
Found 2 hits for monomerid = 446606
TargetProteasome subunit beta type-5(Homo sapiens (Human))
Merck Patent
US Patent
LigandPNGBDBM446606(US10669289, Compound 13)
Affinity DataIC50:  2.75E+3nM. Assay description: Measurement of Beta5 inhibition is performed in 384 well format based on fluorescence intensity assay.Purified human constitutive proteasome (1.25 nM...
Ligand InfoPC cidPC sid
In DepthDetails US Patent
TargetProteasome subunit beta type-8(Homo sapiens (Human))
Merck Patent
US Patent
LigandPNGBDBM446606(US10669289, Compound 13)
Affinity DataIC50: <50nM. Assay description: Measurement of LMP7 inhibition is performed in 384 well format based on fluorescence intensity assay.Purified human immuno proteasome (0.25 nM) and s...
Ligand InfoPC cidPC sid
In DepthDetails US Patent