BDBM446699 US10689327, Compound (II)-1
SMILES OC(=O)[C@@]1(F)[C@@H]2C[C@@H](OCc3ccc(F)cc3)[C@](NC(=O)OCC=C)([C@H]12)C(O)=O
InChI Key InChIKey=UFMGYRJFXQXVOH-GOSIZQOLSA-N
Data  2 IC50
  Tab Delimited (TSV)   2D SDfile   Computed 3D by Vconf -m prep SDfile
Find this compound or compounds like it in BindingDB:
Activity Spreadsheet -- Enzyme Inhibition Constant Data from BindingDB
Found 2 hits for monomerid = 446699
TargetMetabotropic glutamate receptor 3(Homo sapiens (Human))
Taisho Pharmaceutical
US Patent
LigandPNGBDBM446699(US10689327, Compound (II)-1)
Affinity DataIC50:  36.4nM. Assay description: CHO cells stably expressing human metabotropic glutamate receptors mGluR2 and mGluR3 were cultured at 37° C. under 5% CO2 using a Dulbecco's modi...
Ligand InfoPC cidPC sid
In DepthDetails US Patent
TargetMetabotropic glutamate receptor 2(Homo sapiens (Human))
Taisho Pharmaceutical
US Patent
LigandPNGBDBM446699(US10689327, Compound (II)-1)
Affinity DataIC50:  36.1nM. Assay description: CHO cells stably expressing human metabotropic glutamate receptors mGluR2 and mGluR3 were cultured at 37° C. under 5% CO2 using a Dulbecco's modi...
Ligand InfoPC cidPC sid
In DepthDetails US Patent