BDBM446705 N-{4-[2-(dimethyl- amino)ethoxy]- 3,5-dimethyl phenyl}-9-methoxy- 5H,6H-benzo[h] quinazolin-2-amine::US10688093, Compound CT5102-(CellTech)::US11701353, CT5102 (CellTech)
SMILES COc1ccc2CCc3cnc(Nc4cc(C)c(OCCN(C)C)c(C)c4)nc3-c2c1
InChI Key InChIKey=SNPGFHSXAGWITE-UHFFFAOYSA-N
Data  2 IC50
  Tab Delimited (TSV)   2D SDfile   Computed 3D by Vconf -m prep SDfile
Find this compound or compounds like it in BindingDB:
Activity Spreadsheet -- Enzyme Inhibition Constant Data from BindingDB
Found 2 hits for monomerid = 446705
TargetTyrosine-protein kinase Fyn(Homo sapiens (Human))
TBA
US Patent
LigandPNGBDBM446705(N-{4-[2-(dimethyl- amino)ethoxy]- 3,5-dimethyl phe...)
Affinity DataIC50:  8nM. Assay description: The assay procedure determines the IC50 of each potential FYN kinase inhibitor by measuring the enzyme catalyzed ATP-dependent phosphorylation of the...
Ligand InfoPC cidPC sid
In DepthDetails US Patent
TargetTyrosine-protein kinase Fyn(Homo sapiens (Human))
TBA
US Patent
LigandPNGBDBM446705(N-{4-[2-(dimethyl- amino)ethoxy]- 3,5-dimethyl phe...)
Affinity DataIC50:  8nM. Assay description: The ADP-Glo™ Kinase Assay is specifically designed to quantify kinase activity by measuring the ADP produced in the reaction The reaction buffer...
Ligand InfoPC cidPC sid