BDBM446861 (2S,4R)-4-[4-(2-Methyl-1-oxy-pyridin-4-yl)-2-trifluoromethyl-benzenesulfonyl]-1-(1-trifluoromethyl-cyclopropanecarbonyl)-pyrrolidine-2-carboxylic acid (1-cyano-cyclopropyl)-amide::US10689339, Example 2
SMILES Cc1cc(cc[n+]1[O-])-c1ccc(c(c1)C(F)(F)F)S(=O)(=O)[C@@H]1C[C@H](N(C1)C(=O)C1(CC1)C(F)(F)F)C(=O)NC1(CC1)C#N
InChI Key InChIKey=CRHHAQXLDVXCQI-QUCCMNQESA-N
Data  1 IC50
  Tab Delimited (TSV)   2D SDfile   Computed 3D by Vconf -m prep SDfile
Find this compound or compounds like it in BindingDB:
Activity Spreadsheet -- Enzyme Inhibition Constant Data from BindingDB
Found 1 hit for monomerid = 446861
TargetCathepsin S(Homo sapiens (Human))
Hoffmann-La Roche
US Patent
LigandPNGBDBM446861((2S,4R)-4-[4-(2-Methyl-1-oxy-pyridin-4-yl)-2-trifl...)
Affinity DataIC50:  0.770nM. Assay description: Enzyme activity is measured by observing the increase in fluorescence intensity caused by cleavage of a peptide substrate containing a fluorophore wh...
Ligand InfoPC cidPC sid
In DepthDetails US Patent