BDBM447155 4-[6-(1,3- benzodioxol-5- yl)imidazo[1,2- b]pyridazin-3- yl]-2-methoxy- phenol::US10688093, Compound 828_0314_0068::US11701353, Compound 828_0314_0068
SMILES COc1cc(ccc1O)-c1cnc2ccc(nn12)-c1ccc2OCOc2c1
InChI Key InChIKey=MGPFTYWYHMNONB-UHFFFAOYSA-N
Data  2 IC50
  Tab Delimited (TSV)   2D SDfile   Computed 3D by Vconf -m prep SDfile
Find this compound or compounds like it in BindingDB:
Activity Spreadsheet -- Enzyme Inhibition Constant Data from BindingDB
Found 2 hits for monomerid = 447155
TargetTyrosine-protein kinase Fyn(Homo sapiens (Human))
Pathways Neuro Pharma
US Patent
LigandPNGBDBM447155(4-[6-(1,3- benzodioxol-5- yl)imidazo[1,2- b]pyrida...)
Affinity DataIC50:  200nM. Assay description: The ADP-Glo™ Kinase Assay is specifically designed to quantify kinase activity by measuring the ADP produced in the reaction The reaction buffer...
Ligand InfoPC cidPC sid
TargetTyrosine-protein kinase Fyn(Homo sapiens (Human))
Pathways Neuro Pharma
US Patent
LigandPNGBDBM447155(4-[6-(1,3- benzodioxol-5- yl)imidazo[1,2- b]pyrida...)
Affinity DataIC50:  200nM. Assay description: The assay procedure determines the IC50 of each potential FYN kinase inhibitor by measuring the enzyme catalyzed ATP-dependent phosphorylation of the...
Ligand InfoPC cidPC sid
In DepthDetails US Patent