BDBM44722 1-(2-benzylsulfanyl-4,5-dihydroimidazol-1-yl)propan-1-one::1-[2-(benzylthio)-2-imidazolin-1-yl]propan-1-one::1-[2-(phenylmethylsulfanyl)-4,5-dihydroimidazol-1-yl]propan-1-one::1-[2-(phenylmethylthio)-4,5-dihydroimidazol-1-yl]-1-propanone::MLS000117076::SMR000094030::cid_3609825
SMILES CCC(=O)N1CCN=C1SCc1ccccc1
InChI Key InChIKey=NRFVKWMXTVMTKQ-UHFFFAOYSA-N
Data  1 IC50  1 EC50
  Tab Delimited (TSV)   2D SDfile   Computed 3D by Vconf -m prep SDfile
Find this compound or compounds like it in BindingDB:
Activity Spreadsheet -- Enzyme Inhibition Constant Data from BindingDB
Found 2 hits for monomerid = 44722
TargetKallikrein-5(Homo sapiens (Human))
Pcmd
Curated by PubChem BioAssay
LigandPNGBDBM44722(1-(2-benzylsulfanyl-4,5-dihydroimidazol-1-yl)propa...)
Affinity DataIC50:  5.00E+4nM. Assay description: Molecular Library Screening Center Network (MLSCN) Penn Center for Molecular Discovery (PCMD) Assay Provider: Scott L. Diamond, University of Pennsy...
In DepthDetails PCBioAssay
TargetMultidrug resistance-associated protein 1(Homo sapiens (Human))
Srmlsc
Curated by PubChem BioAssay
LigandPNGBDBM44722(1-(2-benzylsulfanyl-4,5-dihydroimidazol-1-yl)propa...)
Affinity DataEC50:  3.98E+3nM. Assay description: Southern Research Molecular Libraries Screening Center (SRMLSC) Southern Research Institute (Birmingham, Alabama) NIH Molecular Libraries Screening C...
In DepthDetails PCBioAssay